BDBM374643 1-((R)-1-(2,4-Dichlorophenyl)ethyl)-6-((3′S,4′R)-3′-methyl-[1,4′-bipiperidin]-1′-yl)-1H-pyrazolo[3,4-b]pyrazine-3-carbonitrile hydrochloride::US10246462, Example 24
SMILES C[C@H](c1ccc(Cl)cc1Cl)n1nc(C#N)c2ncc(nc12)N1CCC([C@@H](C)C1)N1CCCCC1
InChI Key InChIKey=XJOGPQMFXGLNLG-NCHORFDRSA-N
Data  1 IC50
  Tab Delimited (TSV)   2D SDfile   Computed 3D by Vconf -m prep SDfile
Find this compound or compounds like it in BindingDB:
Activity Spreadsheet -- Enzyme Inhibition Constant Data from BindingDB
Found 1 hit for monomerid = 374643
TargetC-C chemokine receptor type 4(Homo sapiens (Human))
Flx Bio
US Patent
LigandPNGBDBM374643(1-((R)-1-(2,4-Dichlorophenyl)ethyl)-6-((3′S,...)
Affinity DataIC50: >500nM. Assay description: To measure binding of 125I-TARC or 125I-MDC to cells expressing CCR4 (e.g., CEM cells (e.g., ATCC HB-12624)), the 125I-TARC or 125I-MDC is diluted to...
Ligand InfoPC cidPC sid
In DepthDetails US Patent