BDBM374664 3-((R)-1-((3R,4S)-1-(1-((R)-1-(2,4-Dichlorophenyl)ethyl)-3-methyl-1H-pyrazolo[3,4-b]pyrazin-6-yl)-3-methylpiperidin-4-yl)pyrrolidin-2-yl)ethan-1-amine::US10246462, Example 45
SMILES C[C@H](c1ccc(Cl)cc1Cl)n1nc(C)c2ncc(nc12)N1CCC([C@H](C)C1)N1CCC[C@H]1CCN
InChI Key InChIKey=IJYGRMUVPUSHRW-BKWPFJTKSA-N
Data  1 IC50
  Tab Delimited (TSV)   2D SDfile   Computed 3D by Vconf -m prep SDfile
Find this compound or compounds like it in BindingDB:
Activity Spreadsheet -- Enzyme Inhibition Constant Data from BindingDB
Found 1 hit for monomerid = 374664
TargetC-C chemokine receptor type 4(Homo sapiens (Human))
Flx Bio
US Patent
LigandPNGBDBM374664(3-((R)-1-((3R,4S)-1-(1-((R)-1-(2,4-Dichlorophenyl)...)
Affinity DataIC50:  300nM. Assay description: To measure binding of 125I-TARC or 125I-MDC to cells expressing CCR4 (e.g., CEM cells (e.g., ATCC HB-12624)), the 125I-TARC or 125I-MDC is diluted to...
Ligand InfoPC cidPC sid
In DepthDetails US Patent