BDBM374707 US10246462, Example 88
SMILES C[C@H](c1ccc(Cl)cc1Cl)n1nc(c2ncc(nc12)C1=CCC(C(C)C1)N1CCC[C@H]1C)C(F)(F)F
InChI Key InChIKey=NMQMFMKXYBMQKT-YZEMWESSSA-N
Data  1 IC50
  Tab Delimited (TSV)   2D SDfile   Computed 3D by Vconf -m prep SDfile
Find this compound or compounds like it in BindingDB:
Activity Spreadsheet -- Enzyme Inhibition Constant Data from BindingDB
Found 1 hit for monomerid = 374707
TargetC-C chemokine receptor type 4(Homo sapiens (Human))
Flx Bio
US Patent
LigandPNGBDBM374707(US10246462, Example 88)
Affinity DataIC50:  300nM. Assay description: To measure binding of 125I-TARC or 125I-MDC to cells expressing CCR4 (e.g., CEM cells (e.g., ATCC HB-12624)), the 125I-TARC or 125I-MDC is diluted to...
Ligand InfoPC cidPC sid
In DepthDetails US Patent