BDBM374932 Methyl 4-(6-(2-(4-(2-methylpyridin-4-yl)phenyl)acetamido)pyridin-3-yl)piperazine-1-carboxylate ::US10251893, Cpd 132
SMILES COC(=O)N1CCN(CC1)c1ccc(NC(=O)Cc2ccc(cc2)-c2ccnc(C)c2)nc1
InChI Key InChIKey=WWKOQBIJJONXMW-UHFFFAOYSA-N
Data  1 IC50
  Tab Delimited (TSV)   2D SDfile   Computed 3D by Vconf -m prep SDfile
Find this compound or compounds like it in BindingDB:
Activity Spreadsheet -- Enzyme Inhibition Constant Data from BindingDB
Found 1 hit for monomerid = 374932
TargetProtein Wnt-3a(Homo sapiens (Human))
Novartis
US Patent
LigandPNGBDBM374932(Methyl 4-(6-(2-(4-(2-methylpyridin-4-yl)phenyl)ace...)
Affinity DataIC50:  0.100nM. Assay description: Human embryonic kidney 293 cells (obtained from American Type Culture Collection, ATCC, Manassas, Va.) are cultured in DMEM medium (Gibco/Invitrogen,...
Ligand InfoPC cidPC sid
In DepthDetails US Patent