BDBM374996 N-(5-(4-acetylpiperazin-1-yl)pyridin-2-yl)-2-(2-fluoro-5-methyl-4-(2-methylpyridin-4-yl)phenyl)acetamide ::US10251893, Cpd 191
SMILES CC(=O)N1CCN(CC1)c1ccc(NC(=O)Cc2cc(C)c(cc2F)-c2ccnc(C)c2)nc1
InChI Key InChIKey=NORZTPPZZGDQHU-UHFFFAOYSA-N
Data  1 IC50
  Tab Delimited (TSV)   2D SDfile   Computed 3D by Vconf -m prep SDfile
Find this compound or compounds like it in BindingDB:
Activity Spreadsheet -- Enzyme Inhibition Constant Data from BindingDB
Found 1 hit for monomerid = 374996
TargetProtein Wnt-3a(Homo sapiens (Human))
Novartis
US Patent
LigandPNGBDBM374996(N-(5-(4-acetylpiperazin-1-yl)pyridin-2-yl)-2-(2-fl...)
Affinity DataIC50:  0.0400nM. Assay description: Human embryonic kidney 293 cells (obtained from American Type Culture Collection, ATCC, Manassas, Va.) are cultured in DMEM medium (Gibco/Invitrogen,...
Ligand InfoPC cidPC sid
In DepthDetails US Patent