BDBM375044 US10252984, Table 2.5
SMILES CCN(CC)c1ccc(C2Nc3cccc4cccc(N2)c34)c(O)c1
InChI Key InChIKey=RPXUXCFXWGEKGU-UHFFFAOYSA-N
Data  1 IC50
  Tab Delimited (TSV)   2D SDfile   Computed 3D by Vconf -m prep SDfile
Find this compound or compounds like it in BindingDB:
Activity Spreadsheet -- Enzyme Inhibition Constant Data from BindingDB
Found 1 hit for monomerid = 375044
TargetG protein-coupled receptor kinase 6(Homo sapiens (Human))
Mayo Foundation
US Patent
LigandPNGBDBM375044(US10252984, Table 2.5)
Affinity DataIC50:  8.44E+3nM. Assay description: TBD
In DepthDetails US Patent