BDBM375046 US10252984, Table 2.7
SMILES Cc1cccc(NC2=NC(=O)\C(S2)=C\c2ccc(O)c(O)c2)c1C
InChI Key InChIKey=USTZKVKLINTJHZ-SXGWCWSVSA-N
Data  1 IC50
  Tab Delimited (TSV)   2D SDfile   Computed 3D by Vconf -m prep SDfile
Find this compound or compounds like it in BindingDB:
Activity Spreadsheet -- Enzyme Inhibition Constant Data from BindingDB
Found 1 hit for monomerid = 375046
TargetG protein-coupled receptor kinase 6(Homo sapiens (Human))
Mayo Foundation
US Patent
LigandPNGBDBM375046(US10252984, Table 2.7)
Affinity DataIC50:  7.11E+3nM. Assay description: TBD
In DepthDetails US Patent