BDBM375047 US10252984, Table 2.8
SMILES COc1ccc(NC(c2ccccn2)c2ccc3cccnc3c2O)cc1
InChI Key InChIKey=VBEITGLBDAOQQK-UHFFFAOYSA-N
Data  1 IC50
  Tab Delimited (TSV)   2D SDfile   Computed 3D by Vconf -m prep SDfile
Find this compound or compounds like it in BindingDB:
Activity Spreadsheet -- Enzyme Inhibition Constant Data from BindingDB
Found 1 hit for monomerid = 375047
TargetG protein-coupled receptor kinase 6(Homo sapiens (Human))
Mayo Foundation
US Patent
LigandPNGBDBM375047(US10252984, Table 2.8)
Affinity DataIC50:  1.03E+4nM. Assay description: TBD
In DepthDetails US Patent