BDBM375053 US10252984, Table 2.14
SMILES Cc1ccc(o1)-c1ccccc1NS(=O)(=O)c1ccc(cc1)S(=O)(=O)N1CCCCCC1
InChI Key InChIKey=FOTYSZIFWYOULL-UHFFFAOYSA-N
Data  1 IC50
  Tab Delimited (TSV)   2D SDfile   Computed 3D by Vconf -m prep SDfile
Find this compound or compounds like it in BindingDB:
Activity Spreadsheet -- Enzyme Inhibition Constant Data from BindingDB
Found 1 hit for monomerid = 375053
TargetG protein-coupled receptor kinase 6(Homo sapiens (Human))
Mayo Foundation
US Patent
LigandPNGBDBM375053(US10252984, Table 2.14)
Affinity DataIC50: >6.00E+4nM. Assay description: TBD
Ligand InfoPC cidPC sid
In DepthDetails US Patent