BDBM375115 US10253004, Example 29
SMILES COc1cc(OC)c(Cl)c(c1Cl)-c1ccc(F)c2[C@@H](CCc12)Nc1cnc(cn1)[C@H]1C[C@@H]1C(O)=O
InChI Key InChIKey=SXCQEUNXOAHCAM-OFQRWUPVSA-N
Data  1 EC50
  Tab Delimited (TSV)   2D SDfile   Computed 3D by Vconf -m prep SDfile
Find this compound or compounds like it in BindingDB:
Activity Spreadsheet -- Enzyme Inhibition Constant Data from BindingDB
Found 1 hit for monomerid = 375115
TargetFree fatty acid receptor 1(Homo sapiens (Human))
Boehringer Ingelheim International
US Patent
LigandPNGBDBM375115(US10253004, Example 29)
Affinity DataEC50:  5nM. Assay description: IP1 accumulation measurements using the IPOne assay system—1321N1 cells stably expressing human GPR40 receptor (Euroscreen, Belgium) are seeded 24 h ...
Ligand InfoPC cidPC sid
In DepthDetails US Patent