BDBM375151 6-chloro-3-[(1S)-1-{[6-(2-::US10253015, Compound I-11
SMILES C[C@H](Nc1cccc(n1)N1CCOC1=O)c1cc2cc(Cl)ccc2[nH]c1=O
InChI Key
Data  4 IC50
  Tab Delimited (TSV)   2D SDfile   Computed 3D by Vconf -m prep SDfile
Find this compound or compounds like it in BindingDB:
Activity Spreadsheet -- Enzyme Inhibition Constant Data from BindingDB
Found 4 hits for monomerid = 375151
TargetIsocitrate dehydrogenase [NADP] cytoplasmic [R132H](Homo sapiens (Human))
Forma Tm2
US Patent
LigandPNGBDBM375151(6-chloro-3-[(1S)-1-{[6-(2- | US10253015, Compound ...)
Affinity DataIC50: <10nM. Assay description: Assays were performed in a 384-well black plate. An aliquot of 250 nL of compound was incubated with 10 μL of 30 nM IDH1-R132H or 10 nM IDH1-R13...
Ligand InfoPC cidPC sid
In DepthDetails US Patent
TargetIsocitrate dehydrogenase [NADP] cytoplasmic [R132C](Homo sapiens (Human))
Forma Tm2
US Patent
LigandPNGBDBM375151(6-chloro-3-[(1S)-1-{[6-(2- | US10253015, Compound ...)
Affinity DataIC50:  550nM. Assay description: HCT116 isogenic IDH1-R132H and IDH1-R132C mutant cells were cultured in growth media (McCoy's 5 A, 10% fetal bovine serum, 1× antibiotic-antimyco...
Ligand InfoPC cidPC sid
In DepthDetails US Patent
TargetIsocitrate dehydrogenase [NADP] cytoplasmic [R132H](Homo sapiens (Human))
Forma Tm2
US Patent
LigandPNGBDBM375151(6-chloro-3-[(1S)-1-{[6-(2- | US10253015, Compound ...)
Affinity DataIC50:  55nM. Assay description: HCT116 isogenic IDH1-R132H and IDH1-R132C mutant cells were cultured in growth media (McCoy's 5 A, 10% fetal bovine serum, 1× antibiotic-antimyco...
Ligand InfoPC cidPC sid
In DepthDetails US Patent
TargetIsocitrate dehydrogenase [NADP] cytoplasmic [R132C](Homo sapiens (Human))
Forma Tm2
US Patent
LigandPNGBDBM375151(6-chloro-3-[(1S)-1-{[6-(2- | US10253015, Compound ...)
Affinity DataIC50:  55nM. Assay description: Assays were performed in a 384-well black plate. An aliquot of 250 nL of compound was incubated with 10 μL of 30 nM IDH1-R132H or 10 nM IDH1-R13...
Ligand InfoPC cidPC sid
In DepthDetails US Patent