BDBM375160 6-chloro-3-[(1R)-1-({6-::US10253015, Compound I-20
SMILES CC(C)[C@H]1COC(=O)N1c1cccc(N[C@H](C)c2cc3cc(Cl)ccc3[nH]c2=O)n1
InChI Key
Data  1 IC50
  Tab Delimited (TSV)   2D SDfile   Computed 3D by Vconf -m prep SDfile
Find this compound or compounds like it in BindingDB:
Activity Spreadsheet -- Enzyme Inhibition Constant Data from BindingDB
Found 1 hit for monomerid = 375160
TargetIsocitrate dehydrogenase [NADP] cytoplasmic [R132H](Homo sapiens (Human))
Forma Tm2
US Patent
LigandPNGBDBM375160(6-chloro-3-[(1R)-1-({6- | US10253015, Compound I-2...)
Affinity DataIC50: >1.00E+3nM. Assay description: Assays were performed in a 384-well black plate. An aliquot of 250 nL of compound was incubated with 10 μL of 30 nM IDH1-R132H or 10 nM IDH1-R13...
Ligand InfoPC cidPC sid
In DepthDetails US Patent