BDBM375171 6-{[1-(6-chloro-2-oxo-1,2-::US10253015, Compound I-31
SMILES Cc1nc(NC2(CC2)c2cc3cc(Cl)ccc3[nH]c2=O)ccc1C#N
InChI Key InChIKey=BLXUDHRDQAGDOD-UHFFFAOYSA-N
Data  2 IC50
  Tab Delimited (TSV)   2D SDfile   Computed 3D by Vconf -m prep SDfile
Find this compound or compounds like it in BindingDB:
Activity Spreadsheet -- Enzyme Inhibition Constant Data from BindingDB
Found 2 hits for monomerid = 375171
TargetIsocitrate dehydrogenase [NADP] cytoplasmic(Homo sapiens (Human))
Forma Therapeutics
Curated by ChEMBL
LigandPNGBDBM375171(6-{[1-(6-chloro-2-oxo-1,2- | US10253015, Compound ...)
Affinity DataIC50:  100nM. Assay description: Inhibition of human Myc-DDK-tagged IDH1 R132H mutant assessed as reduction in NADPH consumption pre-incubated for 15 mins followed by alpha-ketogluta...
Ligand InfoPC cidPC sid
In DepthDetails ArticlePubMed
TargetIsocitrate dehydrogenase [NADP] cytoplasmic [R132H](Homo sapiens (Human))
Forma Tm2
US Patent
LigandPNGBDBM375171(6-{[1-(6-chloro-2-oxo-1,2- | US10253015, Compound ...)
Affinity DataIC50:  55nM. Assay description: Assays were performed in a 384-well black plate. An aliquot of 250 nL of compound was incubated with 10 μL of 30 nM IDH1-R132H or 10 nM IDH1-R13...
Ligand InfoPC cidPC sid
In DepthDetails US Patent