BDBM375189 6-chloro-3-[(1S)-1-{[4-(1-methyl-1H-pyrazol-5-::US10253015, Compound I-49
SMILES C[C@H](Nc1cc(ccn1)-c1ccnn1C)c1cc2cc(Cl)ccc2[nH]c1=O
InChI Key
Data  2 IC50
  Tab Delimited (TSV)   2D SDfile   Computed 3D by Vconf -m prep SDfile
Find this compound or compounds like it in BindingDB:
Activity Spreadsheet -- Enzyme Inhibition Constant Data from BindingDB
Found 2 hits for monomerid = 375189
TargetIsocitrate dehydrogenase [NADP] cytoplasmic [R132C](Homo sapiens (Human))
Forma Tm2
US Patent
LigandPNGBDBM375189(6-chloro-3-[(1S)-1-{[4-(1-methyl-1H-pyrazol-5- | U...)
Affinity DataIC50:  550nM. Assay description: Assays were performed in a 384-well black plate. An aliquot of 250 nL of compound was incubated with 10 μL of 30 nM IDH1-R132H or 10 nM IDH1-R13...
Ligand InfoPC cidPC sid
In DepthDetails US Patent
TargetIsocitrate dehydrogenase [NADP] cytoplasmic [R132H](Homo sapiens (Human))
Forma Tm2
US Patent
LigandPNGBDBM375189(6-chloro-3-[(1S)-1-{[4-(1-methyl-1H-pyrazol-5- | U...)
Affinity DataIC50:  550nM. Assay description: Assays were performed in a 384-well black plate. An aliquot of 250 nL of compound was incubated with 10 μL of 30 nM IDH1-R132H or 10 nM IDH1-R13...
Ligand InfoPC cidPC sid
In DepthDetails US Patent