BDBM375234 3-chloro-5-(3-fluoropyridin-4-yl)-6-(6-methoxypyridin-3-yl)pyridin-2-amine::US10253017, Example 36
SMILES COc1ccc(cn1)-c1nc(N)cc(Cl)c1-c1ccnc(F)c1
InChI Key InChIKey=XGQTVURBKMEEAQ-UHFFFAOYSA-N
Data  2 KI
  Tab Delimited (TSV)   2D SDfile   Computed 3D by Vconf -m prep SDfile
Find this compound or compounds like it in BindingDB:
Activity Spreadsheet -- Enzyme Inhibition Constant Data from BindingDB
Found 2 hits for monomerid = 375234
TargetAdenosine receptor A2b(Homo sapiens (Human))
Palobiofarma
US Patent
LigandPNGBDBM375234(3-chloro-5-(3-fluoropyridin-4-yl)-6-(6-methoxypyri...)
Affinity DataKi:  24nM. Assay description: The binding assay for adenosine A2B receptor subtype was carried out on human recombinant source (HEK-293 cells) and [3H]DPCPX as radioligand, accord...
Ligand InfoPC cidPC sid
In DepthDetails US Patent
TargetAdenosine receptor A2a(Homo sapiens (Human))
Palobiofarma
US Patent
LigandPNGBDBM375234(3-chloro-5-(3-fluoropyridin-4-yl)-6-(6-methoxypyri...)
Affinity DataKi: >5.00E+3nM. Assay description: The binding assay for adenosine A2B receptor subtype was carried out on human recombinant source (HEK-293 cells) and [3H]DPCPX as radioligand, accord...
Ligand InfoPC cidPC sid
In DepthDetails US Patent