BDBM375247 US10253018, Example 13
SMILES CC(C)CN(C)c1nc2cc(C(=O)Nc3cccc(n3)-c3nncn3C(C)C)c(F)cc2nc1OC(C)C
InChI Key InChIKey=IIYZFCLGJBJIFB-UHFFFAOYSA-N
Data  1 IC50
  Tab Delimited (TSV)   2D SDfile   Computed 3D by Vconf -m prep SDfile
Find this compound or compounds like it in BindingDB:
Activity Spreadsheet -- Enzyme Inhibition Constant Data from BindingDB
Found 1 hit for monomerid = 375247
TargetMitogen-activated protein kinase kinase kinase 5(Homo sapiens (Human))
Enanta Pharmaceuticals
US Patent
LigandPNGBDBM375247(US10253018, Example 13)
Affinity DataIC50:  550nM. Assay description: ASK1 was purchased from Thermofisher (Catalogue # PV4011), ATP was purchased from Sigma (Catalogue # A7699), HTRF® KinEASE™ Assay System was obtained...
Ligand InfoPC cidPC sid
In DepthDetails US Patent