BDBM375248 US10253018, Example 14
SMILES CC(C)Nc1nc2cc(C(=O)Nc3cccc(n3)-c3nnnn3C(C)C)c(F)cc2nc1OC(C)C
InChI Key InChIKey=RDPBOBLKSRHUAS-UHFFFAOYSA-N
Data  1 IC50
  Tab Delimited (TSV)   2D SDfile   Computed 3D by Vconf -m prep SDfile
Find this compound or compounds like it in BindingDB:
Activity Spreadsheet -- Enzyme Inhibition Constant Data from BindingDB
Found 1 hit for monomerid = 375248
TargetMitogen-activated protein kinase kinase kinase 5(Homo sapiens (Human))
Enanta Pharmaceuticals
US Patent
LigandPNGBDBM375248(US10253018, Example 14)
Affinity DataIC50: >1.00E+3nM. Assay description: ASK1 was purchased from Thermofisher (Catalogue # PV4011), ATP was purchased from Sigma (Catalogue # A7699), HTRF® KinEASE™ Assay System was obtained...
Ligand InfoPC cidPC sid
In DepthDetails US Patent