BDBM375273 US10253018, Example 39
SMILES CC(C)n1cnnc1-c1cccc(NC(=O)c2ccc3ccccc3c2)n1
InChI Key InChIKey=LOIDEKMGDFRIEV-UHFFFAOYSA-N
Data  1 IC50
  Tab Delimited (TSV)   2D SDfile   Computed 3D by Vconf -m prep SDfile
Find this compound or compounds like it in BindingDB:
Activity Spreadsheet -- Enzyme Inhibition Constant Data from BindingDB
Found 1 hit for monomerid = 375273
TargetMitogen-activated protein kinase kinase kinase 5(Homo sapiens (Human))
Enanta Pharmaceuticals
US Patent
LigandPNGBDBM375273(US10253018, Example 39)
Affinity DataIC50:  550nM. Assay description: ASK1 was purchased from Thermofisher (Catalogue # PV4011), ATP was purchased from Sigma (Catalogue # A7699), HTRF® KinEASE™ Assay System was obtained...
Ligand InfoPC cidPC sid
In DepthDetails US Patent