BDBM375313 (4-(3-(4-hydroxyphenyl)imidazo[1,2-a]pyrazin-6-yl)phenyl)(4-methylpiperazin-1-yl)methanone::US9908886, Example 1
SMILES CN1CCN(CC1)C(=O)c1ccc(cc1)-c1cn2c(cnc2cn1)-c1ccc(O)cc1
InChI Key InChIKey=ZROBKNPXIOQRBD-UHFFFAOYSA-N
Data  5 IC50
  Tab Delimited (TSV)   2D SDfile   Computed 3D by Vconf -m prep SDfile
Find this compound or compounds like it in BindingDB:
Activity Spreadsheet -- Enzyme Inhibition Constant Data from BindingDB
Found 5 hits for monomerid = 375313
TargetMAP kinase-interacting serine/threonine-protein kinase 1(Homo sapiens (Human))
Agency For Science, Technology And Research
US Patent
LigandPNGBDBM375313((4-(3-(4-hydroxyphenyl)imidazo[1,2-a]pyrazin-6-yl)...)
Affinity DataIC50: <100nM. Assay description: MNK1 and MNK2 inhibitor activity was determined using recombinant kinase domains expressed in E. coli. MNK1 and MNK2 were expressed as GST fusion pro...
Ligand InfoPC cidPC sid
In DepthDetails US Patent
TargetMAP kinase-interacting serine/threonine-protein kinase 2(Homo sapiens (Human))
Agency For Science, Technology And Research
US Patent
LigandPNGBDBM375313((4-(3-(4-hydroxyphenyl)imidazo[1,2-a]pyrazin-6-yl)...)
Affinity DataIC50: <100nM. Assay description: MNK1 and MNK2 inhibitor activity was determined using recombinant kinase domains expressed in E. coli. MNK1 and MNK2 were expressed as GST fusion pro...
Ligand InfoPC cidPC sid
In DepthDetails US Patent
TargetMAP kinase-interacting serine/threonine-protein kinase 2(Homo sapiens (Human))
Agency For Science, Technology And Research
US Patent
LigandPNGBDBM375313((4-(3-(4-hydroxyphenyl)imidazo[1,2-a]pyrazin-6-yl)...)
Affinity DataIC50:  140nM. Assay description: Inhibition of GST-tagged MNK2 (72 to 385 residues) (unknown origin) expressed in Escherichia coli BL21(DE3) using JH3 peptide as substrate preincubat...
Ligand InfoPC cidPC sid
In DepthDetails ArticlePubMed
TargetMAP kinase-interacting serine/threonine-protein kinase 1/2(Homo sapiens (Human))
Agency For Science, Technology And Research (A*Star)
Curated by ChEMBL
LigandPNGBDBM375313((4-(3-(4-hydroxyphenyl)imidazo[1,2-a]pyrazin-6-yl)...)
Affinity DataIC50:  189nM. Assay description: Inhibition of MNK1/2 in human HeLa cells assessed as decrease in eIF4E phosphorylation at Ser209 after 2 hrs by AlphaScreen assay
Ligand InfoPC cidPC sid
In DepthDetails ArticlePubMed
TargetMAP kinase-interacting serine/threonine-protein kinase 1(Homo sapiens (Human))
Agency For Science, Technology And Research
US Patent
LigandPNGBDBM375313((4-(3-(4-hydroxyphenyl)imidazo[1,2-a]pyrazin-6-yl)...)
Affinity DataIC50:  284nM. Assay description: Inhibition of GST-tagged MNK1 (37 to 341 residues) (unknown origin) expressed in Escherichia coli BL21(DE3) using JH3 peptide as substrate preincubat...
Ligand InfoPC cidPC sid
In DepthDetails ArticlePubMed