BDBM37563 2-(2,2-dimethyl-1-oxopropyl)imino-1-(3-methoxypropyl)-5-oxo-3-dipyrido[1,2-d:3',4'-f]pyrimidinecarboxylic acid ethyl ester::5-keto-1-(3-methoxypropyl)-2-pivaloylimino-dipyrido[1,2-d:3',4'-f]pyrimidine-3-carboxylic acid ethyl ester::MLS000044280::SMR000022062::cid_2152426::ethyl (2Z)-2-[(2,2-dimethylpropanoyl)imino]-1-(3-methoxypropyl)-5-oxo-1,5-dihydro-2H-dipyrido[1,2-a:2',3'-d]pyrimidine-3-carboxylate::ethyl 2-(2,2-dimethylpropanoylimino)-1-(3-methoxypropyl)-5-oxidanylidene-dipyrido[1,2-d:3',4'-f]pyrimidine-3-carboxylate::ethyl 2-(2,2-dimethylpropanoylimino)-1-(3-methoxypropyl)-5-oxodipyrido[1,2-d:3',4'-f]pyrimidine-3-carboxylate
SMILES CCOC(=O)c1cc2c(nc3ccccn3c2=O)n(CCCOC)\c1=N\C(=O)C(C)(C)C
InChI Key InChIKey=TUESRXUNLAYQJP-NCELDCMTSA-N
Data  1 IC50
  Tab Delimited (TSV)   2D SDfile   Computed 3D by Vconf -m prep SDfile
Find this compound or compounds like it in BindingDB:
Activity Spreadsheet -- Enzyme Inhibition Constant Data from BindingDB
Found 1 hit for monomerid = 37563
TargetHuntingtin(Homo sapiens (Human))
Columbia University Molecular Screening Center
Curated by PubChem BioAssay
LigandPNGBDBM37563(2-(2,2-dimethyl-1-oxopropyl)imino-1-(3-methoxyprop...)
Affinity DataIC50: >8.00E+3nM. Assay description: The mutation underlying Huntington's disease is an expansion of a polyglutamine tract in the N-terminus of the protein huntingtin (htt). Under no...
In DepthDetails PCBioAssay