BDBM375660 US9908897, Example 44
SMILES Cc1cc(Oc2cccc(F)c2)nc(n1)N1CCC2(CC1)CNCCO2
InChI Key InChIKey=AMRJKHDSDIXQIV-UHFFFAOYSA-N
Data  4 IC50
  Tab Delimited (TSV)   2D SDfile   Computed 3D by Vconf -m prep SDfile
Find this compound or compounds like it in BindingDB:
Activity Spreadsheet -- Enzyme Inhibition Constant Data from BindingDB
Found 4 hits for monomerid = 375660
TargetSodium-dependent dopamine transporter(Homo sapiens (Human))
Chronos Therapeutics
US Patent
LigandPNGBDBM375660(US9908897, Example 44)
Affinity DataIC50:  5.13nM. Assay description: The affinity of the compounds of the invention to the human DAT or NET or SERT transporters is assessed by using the [3H]WIN-35,428 or [3H]nisoxetine...
Ligand InfoPC cidPC sid
In DepthDetails US Patent
TargetPotassium voltage-gated channel subfamily H member 2(Homo sapiens (Human))
Chronos Therapeutics
US Patent
LigandPNGBDBM375660(US9908897, Example 44)
Affinity DataIC50:  1.00E+3nM. Assay description: The affinity of the compounds of the invention to the human DAT or NET or SERT transporters is assessed by using the [3H]WIN-35,428 or [3H]nisoxetine...
Ligand InfoPC cidPC sid
In DepthDetails US Patent
TargetSodium-dependent serotonin transporter(Homo sapiens (Human))
Chronos Therapeutics
US Patent
LigandPNGBDBM375660(US9908897, Example 44)
Affinity DataIC50:  1.58E+4nM. Assay description: The affinity of the compounds of the invention to the human DAT or NET or SERT transporters is assessed by using the [3H]WIN-35,428 or [3H]nisoxetine...
Ligand InfoPC cidPC sid
In DepthDetails US Patent
TargetSodium-dependent noradrenaline transporter(Homo sapiens (Human))
Chronos Therapeutics
US Patent
LigandPNGBDBM375660(US9908897, Example 44)
Affinity DataIC50:  224nM. Assay description: The affinity of the compounds of the invention to the human DAT or NET or SERT transporters is assessed by using the [3H]WIN-35,428 or [3H]nisoxetine...
Ligand InfoPC cidPC sid
In DepthDetails US Patent