BDBM375920 US9914731, Ex. No. 139
SMILES CCn1cc(C(=O)Nc2ccc(Oc3cc(cn4nccc34)C(=O)N(C)C)c(F)c2)c(=O)n(-c2ccc(F)cc2)c1=O
InChI Key InChIKey=HDIVAXBFPDCQOY-UHFFFAOYSA-N
Data  2 IC50
  Tab Delimited (TSV)   2D SDfile   Computed 3D by Vconf -m prep SDfile
Find this compound or compounds like it in BindingDB:
Activity Spreadsheet -- Enzyme Inhibition Constant Data from BindingDB
Found 2 hits for monomerid = 375920
TargetHepatocyte growth factor receptor(Homo sapiens (Human))
Ignyta
US Patent
LigandPNGBDBM375920(US9914731, Ex. No. 139)
Affinity DataIC50: <10nM. Assay description: The cMET kinase assay was performed in 384-well Fluotrac™ 200 HiBase microplates using the HTRF KinEASE™ assay described above for AXL except that th...
Ligand InfoPC cidPC sid
In DepthDetails US Patent
TargetTyrosine-protein kinase receptor UFO(Homo sapiens (Human))
Ignyta
US Patent
LigandPNGBDBM375920(US9914731, Ex. No. 139)
Affinity DataIC50:  550nM. Assay description: The ability of compounds to inhibit the kinase activity of recombinant human baculovirus-expressed AXL was measured by homogeneous TRF (HTRF) using C...
Ligand InfoPC cidPC sid
In DepthDetails US Patent