BDBM376036 N-(2-methyl-4-phenyl-1,3- thiazol-5-yl)-3-(1-methyl-1H- pyrazol-3-yl)-4- (trifluoromethyl)benzamide::US9914736, Compound 32
SMILES Cc1nc(c(NC(=O)c2ccc(c(c2)-c2ccn(C)n2)C(F)(F)F)s1)-c1ccccc1
InChI Key InChIKey=WEEKZCGUOOXEJB-UHFFFAOYSA-N
Data  1 IC50
  Tab Delimited (TSV)   2D SDfile   Computed 3D by Vconf -m prep SDfile
Find this compound or compounds like it in BindingDB:
Activity Spreadsheet -- Enzyme Inhibition Constant Data from BindingDB
Found 1 hit for monomerid = 376036
TargetHigh affinity nerve growth factor receptor(Homo sapiens (Human))
Merck Sharp & Dohme
US Patent
LigandPNGBDBM376036(N-(2-methyl-4-phenyl-1,3- thiazol-5-yl)-3-(1-methy...)
Affinity DataIC50:  6nM. Assay description:  In this assay, U2OS cells express the human TrkA receptor as a fusion with the weakly complementing fragment of B-galactosidase, which DiscoverX cal...
Ligand InfoPC cidPC sid
In DepthDetails US Patent