BDBM37606 3-(furan-2-carbonyl)-4-hydroxy-1-(oxolan-2-ylmethyl)-2-pyridin-3-yl-2H-pyrrol-5-one::3-(furan-2-ylcarbonyl)-4-oxidanyl-1-(oxolan-2-ylmethyl)-2-pyridin-3-yl-2H-pyrrol-5-one::3-[2-furanyl(oxo)methyl]-4-hydroxy-1-(2-oxolanylmethyl)-2-(3-pyridinyl)-2H-pyrrol-5-one::4-(2-furoyl)-3-hydroxy-5-(3-pyridyl)-1-(tetrahydrofurfuryl)-3-pyrrolin-2-one::4-(Furan-2-carbonyl)-3-hydroxy-5-pyridin-3-yl-1-(tetrahydro-furan-2-ylmethyl)-1,5-dihydro-pyrrol-2-one::MLS000075613::SMR000013437::cid_646794
SMILES O=C(C1C(N(CC2CCCO2)C(=O)C1=O)c1cccnc1)c1ccco1
InChI Key InChIKey=VQOHTVBZIJEYMY-UHFFFAOYSA-N
Data  2 KI  2 IC50
  Tab Delimited (TSV)   2D SDfile   Computed 3D by Vconf -m prep SDfile
Find this compound or compounds like it in BindingDB:
Activity Spreadsheet -- Enzyme Inhibition Constant Data from BindingDB
Found 4 hits for monomerid = 37606
TargetfMet-Leu-Phe receptor(Homo sapiens (Human))
Nmmlsc
Curated by PubChem BioAssay
LigandPNGBDBM37606(3-(furan-2-carbonyl)-4-hydroxy-1-(oxolan-2-ylmethy...)
Affinity DataKi:  3.59E+4nM. Assay description: University of New Mexico Assay Overview: Assay Support: NIH 1R03MH076381-01 Assay for Formylpeptide Receptor Family Ligands PI: Bruce S. Edwards, Ph...
In DepthDetails PCBioAssay
TargetN-formyl peptide receptor 2(Homo sapiens (Human))
Nmmlsc
Curated by PubChem BioAssay
LigandPNGBDBM37606(3-(furan-2-carbonyl)-4-hydroxy-1-(oxolan-2-ylmethy...)
Affinity DataKi: >4.03E+4nM. Assay description: University of New Mexico Assay Overview Assay Support: NIH 1R03MH076381-01 Assay for Formylpeptide Receptor Family Ligands PI: Bruce S. Edwards, Ph....
In DepthDetails PCBioAssay
TargetN-formyl peptide receptor 2(Homo sapiens (Human))
Nmmlsc
Curated by PubChem BioAssay
LigandPNGBDBM37606(3-(furan-2-carbonyl)-4-hydroxy-1-(oxolan-2-ylmethy...)
Affinity DataIC50: >6.67E+4nM. Assay description: University of New Mexico Assay Overview Assay Support: NIH 1R03MH076381-01 Assay for Formylpeptide Receptor Family Ligands PI: Bruce S. Edwards, Ph....
In DepthDetails PCBioAssay
TargetfMet-Leu-Phe receptor(Homo sapiens (Human))
Nmmlsc
Curated by PubChem BioAssay
LigandPNGBDBM37606(3-(furan-2-carbonyl)-4-hydroxy-1-(oxolan-2-ylmethy...)
Affinity DataIC50:  5.48E+4nM. Assay description: University of New Mexico Assay Overview: Assay Support: NIH 1R03MH076381-01 Assay for Formylpeptide Receptor Family Ligands PI: Bruce S. Edwards, Ph...
In DepthDetails PCBioAssay