BDBM376110 2-fluoro-N-(2-(1-(2- hydroxyethyl)-1H-pyrazol-4- yl)-4-phenylthiazol-5-yl)-5- (pyrimidin-2-yl)-4- (trifluoromethyl)benzamide::US9914736, Compound 106
SMILES OCCn1cc(cn1)-c1nc(c(NC(=O)c2cc(-c3ncccn3)c(cc2F)C(F)(F)F)s1)-c1ccccc1
InChI Key InChIKey=WNKLEYNYKUCEEI-UHFFFAOYSA-N
Data  1 IC50
  Tab Delimited (TSV)   2D SDfile   Computed 3D by Vconf -m prep SDfile
Find this compound or compounds like it in BindingDB:
Activity Spreadsheet -- Enzyme Inhibition Constant Data from BindingDB
Found 1 hit for monomerid = 376110
TargetHigh affinity nerve growth factor receptor(Homo sapiens (Human))
Merck Sharp & Dohme
US Patent
LigandPNGBDBM376110(2-fluoro-N-(2-(1-(2- hydroxyethyl)-1H-pyrazol-4- y...)
Affinity DataIC50:  6.70nM. Assay description:  In this assay, U2OS cells express the human TrkA receptor as a fusion with the weakly complementing fragment of B-galactosidase, which DiscoverX cal...
Ligand InfoPC cidPC sid
In DepthDetails US Patent