BDBM376517 (R)-N-(1-(3- methoxyphenyl) ethyl) benzofuro[2,3-c] pyridine-7- carboxamide::US9914740, XV-1
SMILES COc1cccc(c1)[C@@H](C)NC(=O)c1ccc2c(c1)oc1cnccc21
InChI Key InChIKey=RWXQCIYEZNPOSV-CYBMUJFWSA-N
Data  1 IC50
  Tab Delimited (TSV)   2D SDfile   Computed 3D by Vconf -m prep SDfile
Find this compound or compounds like it in BindingDB:
Activity Spreadsheet -- Enzyme Inhibition Constant Data from BindingDB
Found 1 hit for monomerid = 376517
TargetRho-associated protein kinase 2(Homo sapiens (Human))
Bristol-Myers Squibb
US Patent
LigandPNGBDBM376517((R)-N-(1-(3- methoxyphenyl) ethyl) benzofuro[2,3-c...)
Affinity DataIC50:  2.85nM. Assay description: The effectiveness of compounds of the present invention as ROCK inhibitors can be determined in a 30 μL assay containing 20 mM HEPES, pH 7.5, 20...
Ligand InfoPC cidPC sid
In DepthDetails US Patent