BDBM376554 US9918990, Example 15
SMILES Cc1nc2c(Oc3ccc(F)cc3F)c(ccc2[nH]1)-c1cn(C)c(=O)c2[nH]ncc12
InChI Key InChIKey=IHGFKDIINAMYMO-UHFFFAOYSA-N
Data  2 IC50
  Tab Delimited (TSV)   2D SDfile   Computed 3D by Vconf -m prep SDfile
Find this compound or compounds like it in BindingDB:
Activity Spreadsheet -- Enzyme Inhibition Constant Data from BindingDB
Found 2 hits for monomerid = 376554
TargetBromodomain-containing protein 2(Homo sapiens (Human))
Incyte
US Patent
LigandPNGBDBM376554(US9918990, Example 15)
Affinity DataIC50: <100nM. Assay description: BRD4-BD1 and BRD4-BD2 assays were conducted in white 384-well polystyrene plate in a final volume of 20 μL for BD1 and 40 μL for BD2. Inhib...
Ligand InfoPC cidPC sid
In DepthDetails US Patent
TargetBromodomain-containing protein 4(Homo sapiens (Human))
Incyte
US Patent
LigandPNGBDBM376554(US9918990, Example 15)
Affinity DataIC50: <100nM. Assay description: BRD4-BD1 and BRD4-BD2 assays were conducted in white 384-well polystyrene plate in a final volume of 20 μL for BD1 and 40 μL for BD2. Inhib...
Ligand InfoPC cidPC sid
In DepthDetails US Patent