BDBM376577 US9918985, Example 20h Isomer 2
SMILES CO[C@H]1CC[C@]2(Cc3ccc(cc3C22N=C(C)C(N)=N2)C#CC(C)(C)C)CC1
InChI Key InChIKey=POIRYFHGYWLALK-FGZXBEKLSA-N
Data  1 IC50
  Tab Delimited (TSV)   2D SDfile   Computed 3D by Vconf -m prep SDfile
Find this compound or compounds like it in BindingDB:
Activity Spreadsheet -- Enzyme Inhibition Constant Data from BindingDB
Found 1 hit for monomerid = 376577
TargetBeta-secretase 1 [1-460](Homo sapiens (Human))
Astrazeneca
US Patent
LigandPNGBDBM376577(US9918985, Example 20h Isomer 2)
Affinity DataIC50:  21nM. Assay description: The enzyme (truncated form) was diluted to 6 μg/mL (stock 1.3 mg/mL) and the substrate (Europium)CEVNLDAEFK(Qsy7) to 200 nM (stock 120 μM) ...
Ligand InfoPC cidPC sid
In DepthDetails US Patent