BDBM376631 5''-methyl-6'-[5-(prop-1-yn-1-yl)pyridin-3-yl]-3'H-dispiro[cyclobutane-1,2'-indene-1',2''-imidazol]-4''-amine::US9918985, Example 57 Isomer 1
SMILES CC#Cc1cncc(c1)-c1ccc2C[C@]3(CCC3)[C@@]3(N=C(C)C(N)=N3)c2c1
InChI Key InChIKey=GEFZXXPGNGYLMH-HSZRJFAPSA-N
Data  1 IC50
  Tab Delimited (TSV)   2D SDfile   Computed 3D by Vconf -m prep SDfile
Find this compound or compounds like it in BindingDB:
Activity Spreadsheet -- Enzyme Inhibition Constant Data from BindingDB
Found 1 hit for monomerid = 376631
TargetBeta-secretase 1 [1-460](Homo sapiens (Human))
Astrazeneca
US Patent
LigandPNGBDBM376631(5''-methyl-6'-[5-(prop-1-yn-1-yl)pyridin-3-yl]-3'H...)
Affinity DataIC50:  19nM. Assay description: The enzyme (truncated form) was diluted to 6 μg/mL (stock 1.3 mg/mL) and the substrate (Europium)CEVNLDAEFK(Qsy7) to 200 nM (stock 120 μM) ...
Ligand InfoPC cidPC sid
In DepthDetails US Patent