BDBM376758 (1R,4R)-Methyl 5-(8-(4-((1R,3S,5S)-3-amino-5-methylcyclohexyl)pyridin-3-ylcarbamoyl)-5-fluoroquinolin-3-yl)-2,5-diazabicyclo[2.2.1]heptane-2-carboxylate::US10450296, Example 90::US11053215, Example 90::US9920032, Example 90
SMILES COC(=O)N1C[C@H]2C[C@@H]1CN2c1cnc2c(ccc(F)c2c1)C(=O)Nc1cnccc1[C@@H]1C[C@H](C)C[C@H](N)C1
InChI Key InChIKey=OOLVHIJJXYHTDS-ARXXEPJESA-N
Data  9 IC50
  Tab Delimited (TSV)   2D SDfile   Computed 3D by Vconf -m prep SDfile
Find this compound or compounds like it in BindingDB:
Activity Spreadsheet -- Enzyme Inhibition Constant Data from BindingDB
Found 9 hits for monomerid = 376758
TargetSerine/threonine-protein kinase pim-1(Homo sapiens (Human))
Incyte
US Patent
LigandPNGBDBM376758((1R,4R)-Methyl 5-(8-(4-((1R,3S,5S)-3-amino-5-methy...)
Affinity DataIC50: <10nM. Assay description: Pim-1 and Pim-3 kinase assays—20 μL reactions were run in white 384 well polystyrene plates dotted with 0.8 μL compound/DMSO in the assay b...
Ligand InfoPC cidPC sid
In DepthDetails US Patent
TargetSerine/threonine-protein kinase pim-2(Homo sapiens (Human))
Incyte
US Patent
LigandPNGBDBM376758((1R,4R)-Methyl 5-(8-(4-((1R,3S,5S)-3-amino-5-methy...)
Affinity DataIC50: <100nM. Assay description: Pim-2 kinase assay—20 μL reactions were run in white 384 well polystyrene plates dotted with 0.8 μL compound/DMSO in the assay buffer (50 m...
Ligand InfoPC cidPC sid
In DepthDetails US Patent
TargetSerine/threonine-protein kinase pim-3(Homo sapiens (Human))
Incyte
US Patent
LigandPNGBDBM376758((1R,4R)-Methyl 5-(8-(4-((1R,3S,5S)-3-amino-5-methy...)
Affinity DataIC50: <10nM. Assay description: Pim-1 and Pim-3 kinase assays—20 μL reactions were run in white 384 well polystyrene plates dotted with 0.8 μL compound/DMSO in the assay b...
Ligand InfoPC cidPC sid
In DepthDetails US Patent
TargetSerine/threonine-protein kinase pim-1(Homo sapiens (Human))
Incyte
US Patent
LigandPNGBDBM376758((1R,4R)-Methyl 5-(8-(4-((1R,3S,5S)-3-amino-5-methy...)
Affinity DataIC50: <10nM. Assay description: Pim-1 and Pim-3 kinase assays-20 μL reactions were run in white 384 well polystyrene plates dotted with 0.8 μL compound/DMSO in the assay b...
Ligand InfoPC cidPC sid
In DepthDetails US Patent
TargetSerine/threonine-protein kinase pim-3(Homo sapiens (Human))
Incyte
US Patent
LigandPNGBDBM376758((1R,4R)-Methyl 5-(8-(4-((1R,3S,5S)-3-amino-5-methy...)
Affinity DataIC50: <10nM. Assay description: Pim-1 and Pim-3 kinase assays-20 μL reactions were run in white 384 well polystyrene plates dotted with 0.8 μL compound/DMSO in the assay b...
Ligand InfoPC cidPC sid
In DepthDetails US Patent
TargetSerine/threonine-protein kinase pim-3(Homo sapiens (Human))
Incyte
US Patent
LigandPNGBDBM376758((1R,4R)-Methyl 5-(8-(4-((1R,3S,5S)-3-amino-5-methy...)
Affinity DataIC50: <10nM. Assay description: Pim-1 and Pim-3 kinase assays-20 μL reactions were run in white 384 well polystyrene plates dotted with 0.8 μL compound/DMSO in the assay b...
Ligand InfoPC cidPC sid
In DepthDetails US Patent
TargetSerine/threonine-protein kinase pim-1(Homo sapiens (Human))
Incyte
US Patent
LigandPNGBDBM376758((1R,4R)-Methyl 5-(8-(4-((1R,3S,5S)-3-amino-5-methy...)
Affinity DataIC50: <10nM. Assay description: Pim-1 and Pim-3 kinase assays-20 μL reactions were run in white 384 well polystyrene plates dotted with 0.8 μL compound/DMSO in the assay b...
Ligand InfoPC cidPC sid
In DepthDetails US Patent
TargetSerine/threonine-protein kinase pim-2(Homo sapiens (Human))
Incyte
US Patent
LigandPNGBDBM376758((1R,4R)-Methyl 5-(8-(4-((1R,3S,5S)-3-amino-5-methy...)
Affinity DataIC50: <100nM. Assay description: Pim-1 and Pim-3 kinase assays-20 μL reactions were run in white 384 well polystyrene plates dotted with 0.8 μL compound/DMSO in the assay b...
Ligand InfoPC cidPC sid
In DepthDetails US Patent
TargetSerine/threonine-protein kinase pim-2(Homo sapiens (Human))
Incyte
US Patent
LigandPNGBDBM376758((1R,4R)-Methyl 5-(8-(4-((1R,3S,5S)-3-amino-5-methy...)
Affinity DataIC50: <100nM. Assay description: Pim-2 kinase assay-20 μL reactions were run in white 384 well polystyrene plates dotted with 0.8 μL compound/DMSO in the assay buffer (50 m...
Ligand InfoPC cidPC sid
In DepthDetails US Patent