BDBM376779 N-(4-((1R,3S,5S)-3-Amino-5-methylcyclohexyl)pyridin-3-yl)-3-(dihydro-1H-furo[3,4-c]pyrrol-5(3H,6H,6aH)-yl)-5-fluoroquinoline-8-carboxamide::US10450296, Example 110::US11053215, Example 110::US9920032, Example 110
SMILES C[C@@H]1C[C@H](N)C[C@@H](C1)c1ccncc1NC(=O)c1ccc(F)c2cc(cnc12)N1CC2COCC2C1
InChI Key InChIKey=OEQFXFUYSLCTPN-SPPIJZGPSA-N
Data  9 IC50
  Tab Delimited (TSV)   2D SDfile   Computed 3D by Vconf -m prep SDfile
Find this compound or compounds like it in BindingDB:
Activity Spreadsheet -- Enzyme Inhibition Constant Data from BindingDB
Found 9 hits for monomerid = 376779
TargetSerine/threonine-protein kinase pim-1(Homo sapiens (Human))
Incyte
US Patent
LigandPNGBDBM376779(N-(4-((1R,3S,5S)-3-Amino-5-methylcyclohexyl)pyridi...)
Affinity DataIC50: <10nM. Assay description: Pim-1 and Pim-3 kinase assays—20 μL reactions were run in white 384 well polystyrene plates dotted with 0.8 μL compound/DMSO in the assay b...
Ligand InfoPC cidPC sid
In DepthDetails US Patent
TargetSerine/threonine-protein kinase pim-2(Homo sapiens (Human))
Incyte
US Patent
LigandPNGBDBM376779(N-(4-((1R,3S,5S)-3-Amino-5-methylcyclohexyl)pyridi...)
Affinity DataIC50: <100nM. Assay description: Pim-2 kinase assay—20 μL reactions were run in white 384 well polystyrene plates dotted with 0.8 μL compound/DMSO in the assay buffer (50 m...
Ligand InfoPC cidPC sid
In DepthDetails US Patent
TargetSerine/threonine-protein kinase pim-3(Homo sapiens (Human))
Incyte
US Patent
LigandPNGBDBM376779(N-(4-((1R,3S,5S)-3-Amino-5-methylcyclohexyl)pyridi...)
Affinity DataIC50: <10nM. Assay description: Pim-1 and Pim-3 kinase assays—20 μL reactions were run in white 384 well polystyrene plates dotted with 0.8 μL compound/DMSO in the assay b...
Ligand InfoPC cidPC sid
In DepthDetails US Patent
TargetSerine/threonine-protein kinase pim-1(Homo sapiens (Human))
Incyte
US Patent
LigandPNGBDBM376779(N-(4-((1R,3S,5S)-3-Amino-5-methylcyclohexyl)pyridi...)
Affinity DataIC50: <10nM. Assay description: Pim-1 and Pim-3 kinase assays-20 μL reactions were run in white 384 well polystyrene plates dotted with 0.8 μL compound/DMSO in the assay b...
Ligand InfoPC cidPC sid
In DepthDetails US Patent
TargetSerine/threonine-protein kinase pim-3(Homo sapiens (Human))
Incyte
US Patent
LigandPNGBDBM376779(N-(4-((1R,3S,5S)-3-Amino-5-methylcyclohexyl)pyridi...)
Affinity DataIC50: <10nM. Assay description: Pim-1 and Pim-3 kinase assays-20 μL reactions were run in white 384 well polystyrene plates dotted with 0.8 μL compound/DMSO in the assay b...
Ligand InfoPC cidPC sid
In DepthDetails US Patent
TargetSerine/threonine-protein kinase pim-3(Homo sapiens (Human))
Incyte
US Patent
LigandPNGBDBM376779(N-(4-((1R,3S,5S)-3-Amino-5-methylcyclohexyl)pyridi...)
Affinity DataIC50: <10nM. Assay description: Pim-1 and Pim-3 kinase assays-20 μL reactions were run in white 384 well polystyrene plates dotted with 0.8 μL compound/DMSO in the assay b...
Ligand InfoPC cidPC sid
In DepthDetails US Patent
TargetSerine/threonine-protein kinase pim-1(Homo sapiens (Human))
Incyte
US Patent
LigandPNGBDBM376779(N-(4-((1R,3S,5S)-3-Amino-5-methylcyclohexyl)pyridi...)
Affinity DataIC50: <10nM. Assay description: Pim-1 and Pim-3 kinase assays-20 μL reactions were run in white 384 well polystyrene plates dotted with 0.8 μL compound/DMSO in the assay b...
Ligand InfoPC cidPC sid
In DepthDetails US Patent
TargetSerine/threonine-protein kinase pim-2(Homo sapiens (Human))
Incyte
US Patent
LigandPNGBDBM376779(N-(4-((1R,3S,5S)-3-Amino-5-methylcyclohexyl)pyridi...)
Affinity DataIC50: <100nM. Assay description: Pim-1 and Pim-3 kinase assays-20 μL reactions were run in white 384 well polystyrene plates dotted with 0.8 μL compound/DMSO in the assay b...
Ligand InfoPC cidPC sid
In DepthDetails US Patent
TargetSerine/threonine-protein kinase pim-2(Homo sapiens (Human))
Incyte
US Patent
LigandPNGBDBM376779(N-(4-((1R,3S,5S)-3-Amino-5-methylcyclohexyl)pyridi...)
Affinity DataIC50: <100nM. Assay description: Pim-2 kinase assay-20 μL reactions were run in white 384 well polystyrene plates dotted with 0.8 μL compound/DMSO in the assay buffer (50 m...
Ligand InfoPC cidPC sid
In DepthDetails US Patent