BDBM376937 US9920047, 67
SMILES Cc1sc(cc1C(=O)NC1CCC(F)(F)CC1)[C@@H]1C[C@H]1NC1CCOCC1
InChI Key InChIKey=YMULIXZFUBPIGR-IAGOWNOFSA-N
Data  3 IC50
  Tab Delimited (TSV)   2D SDfile   Computed 3D by Vconf -m prep SDfile
Find this compound or compounds like it in BindingDB:
Activity Spreadsheet -- Enzyme Inhibition Constant Data from BindingDB
Found 3 hits for monomerid = 376937
TargetLysine-specific histone demethylase 1A(Homo sapiens (Human))
Takeda Pharmaceutical
US Patent
LigandPNGBDBM376937(US9920047, 67)
Affinity DataIC50:  100nM. Assay description: A test compound dissolved in DMSO was added by to a reaction solution (50 mM Tris-HCl (pH 8.0), 0.1% BSA, 1 mM DTT) containing LSD1 enzyme, and the m...
Ligand InfoPC cidPC sid
In DepthDetails US Patent
TargetAmine oxidase [flavin-containing] B(Homo sapiens (Human))
Takeda Pharmaceutical
US Patent
LigandPNGBDBM376937(US9920047, 67)
Affinity DataIC50: >1.00E+5nM. Assay description: A test compound dissolved in DMSO was added to a reaction solution (100 mM HEPES (pH 7.5), 5% glycerol, 10% DMSO) containing MAO-B enzyme (Sigma-Aldr...
Ligand InfoPC cidPC sid
In DepthDetails US Patent
TargetAmine oxidase [flavin-containing] A(Homo sapiens (Human))
Takeda Pharmaceutical
US Patent
LigandPNGBDBM376937(US9920047, 67)
Affinity DataIC50:  7.60E+4nM. Assay description: A test compound dissolved in DMSO was added to a reaction solution (100 mM HEPES (pH 7.5), 5% glycerol) containing MAO-A enzyme (Sigma-Aldrich Co. LL...
Ligand InfoPC cidPC sid
In DepthDetails US Patent