BDBM377004 8-(2-Methoxyphenyl)-N-[3-(piperidin-4-yl)-1-isopropyl-1H-pyrazol-5-yl]quinazolin-2-amine ::US10259816, Compound 25::US10611770, Compound 25
SMILES COc1ccccc1-c1cccc2cnc(Nc3cc(nn3C(C)C)C3CCNCC3)nc12
InChI Key InChIKey=JNASOPFHWAIQII-UHFFFAOYSA-N
Data  2 IC50
  Tab Delimited (TSV)   2D SDfile   Computed 3D by Vconf -m prep SDfile
Find this compound or compounds like it in BindingDB:
Activity Spreadsheet -- Enzyme Inhibition Constant Data from BindingDB
Found 2 hits for monomerid = 377004
TargetALK tyrosine kinase receptor(Homo sapiens (Human))
Guangzhou Maxinovel Pharmaceuticals
US Patent
LigandPNGBDBM377004(8-(2-Methoxyphenyl)-N-[3-(piperidin-4-yl)-1-isopro...)
Affinity DataIC50:  27nM. Assay description: Buffer preparation: 50 mM HEPES, pH 7.5, 0.00015% Brij-35.The compound was configured as a concentration gradient in 100% DMSO and added to a 384-wel...
Ligand InfoPC cidPC sid
In DepthDetails US Patent
TargetALK tyrosine kinase receptor(Homo sapiens (Human))
Guangzhou Maxinovel Pharmaceuticals
US Patent
LigandPNGBDBM377004(8-(2-Methoxyphenyl)-N-[3-(piperidin-4-yl)-1-isopro...)
Affinity DataIC50:  27nM. Assay description: Buffer preparation: 50 mM HEPES, pH 7.5, 0.00015% Brij-35.The compound was configured as a concentration gradient in 100% DMSO and added to a 384-wel...
Ligand InfoPC cidPC sid
In DepthDetails US Patent