BDBM377035 US10259818, Example 17::US9944646, Example 17
SMILES CC(c1cc(Cl)c(C)c2CN(CCOc12)S(=O)(=O)c1c(C)noc1C)n1nc(C)c2c(N)ncnc12
InChI Key InChIKey=FNKVIMDAMHBVAT-UHFFFAOYSA-N
Data  2 IC50
  Tab Delimited (TSV)   2D SDfile   Computed 3D by Vconf -m prep SDfile
Find this compound or compounds like it in BindingDB:
Activity Spreadsheet -- Enzyme Inhibition Constant Data from BindingDB
Found 2 hits for monomerid = 377035
LigandPNGBDBM377035(US10259818, Example 17 | US9944646, Example 17)
Affinity DataIC50: <100nM. Assay description: [γ-33P]ATP (10mCi/mL) was purchased from Perkin-Elmer (Waltham, Mass.). Lipid kinase substrate, D-myo-Phosphatidylinositol 4,5-bisphosphate (Ptd...
Ligand InfoPC cidPC sid
In DepthDetails US Patent
LigandPNGBDBM377035(US10259818, Example 17 | US9944646, Example 17)
Affinity DataIC50: <100nM. Assay description: Lipid kinase substrate, phosphoinositol-4,5-bisphosphate (PIP2), are purchased from Echelon Biosciences (Salt Lake City, Utah). PI3K isoforms α,...
Ligand InfoPC cidPC sid
In DepthDetails US Patent