BDBM377048 US10259818, Example 30::US9944646, Example 30
SMILES C[C@H](c1cc(Cl)c(F)c2CN(C[C@@H](C)Oc12)C1CN(C1)C(C)=O)n1nc(C)c2c(N)ncnc12
InChI Key InChIKey=PHXYAQRIODZOPM-DGCLKSJQSA-N
Data  2 IC50
  Tab Delimited (TSV)   2D SDfile   Computed 3D by Vconf -m prep SDfile
Find this compound or compounds like it in BindingDB:
Activity Spreadsheet -- Enzyme Inhibition Constant Data from BindingDB
Found 2 hits for monomerid = 377048
LigandPNGBDBM377048(US10259818, Example 30 | US9944646, Example 30)
Affinity DataIC50: <100nM. Assay description: [γ-33P]ATP (10mCi/mL) was purchased from Perkin-Elmer (Waltham, Mass.). Lipid kinase substrate, D-myo-Phosphatidylinositol 4,5-bisphosphate (Ptd...
Ligand InfoPC cidPC sid
In DepthDetails US Patent
LigandPNGBDBM377048(US10259818, Example 30 | US9944646, Example 30)
Affinity DataIC50: <100nM. Assay description: The kinase reaction was conducted in polystyrene 384-well matrix white plate from Thermo Fisher Scientific in a final volume of 25 μL. Inhibitor...
Ligand InfoPC cidPC sid
In DepthDetails US Patent