BDBM377063 US10259818, Example 45
SMILES CC(c1cc(Cl)c(F)c2CN(CCCOc12)S(C)(=O)=O)n1nc(C)c2c(N)ncnc12
InChI Key InChIKey=WNWMZQVYIFTJAB-UHFFFAOYSA-N
Data  1 IC50
  Tab Delimited (TSV)   2D SDfile   Computed 3D by Vconf -m prep SDfile
Find this compound or compounds like it in BindingDB:
Activity Spreadsheet -- Enzyme Inhibition Constant Data from BindingDB
Found 1 hit for monomerid = 377063
LigandPNGBDBM377063(US10259818, Example 45)
Affinity DataIC50: <100nM. Assay description: [γ-33P]ATP (10mCi/mL) was purchased from Perkin-Elmer (Waltham, Mass.). Lipid kinase substrate, D-myo-Phosphatidylinositol 4,5-bisphosphate (Ptd...
Ligand InfoPC cidPC sid
In DepthDetails US Patent