BDBM377083 US10259818, Example 65::US9944646, Example 66
SMILES CC(c1cc(Cl)c(C#N)c2CN(CC(C)(C)O)C[C@H](C)Oc12)n1nc(C)c2c(N)ncnc12
InChI Key InChIKey=NWKGJTSGVQUXDL-NBFOIZRFSA-N
Data  2 IC50
  Tab Delimited (TSV)   2D SDfile   Computed 3D by Vconf -m prep SDfile
Find this compound or compounds like it in BindingDB:
Activity Spreadsheet -- Enzyme Inhibition Constant Data from BindingDB
Found 2 hits for monomerid = 377083
LigandPNGBDBM377083(US10259818, Example 65 | US9944646, Example 66)
Affinity DataIC50: <100nM. Assay description: [γ-33P]ATP (10mCi/mL) was purchased from Perkin-Elmer (Waltham, Mass.). Lipid kinase substrate, D-myo-Phosphatidylinositol 4,5-bisphosphate (Ptd...
Ligand InfoPC cidPC sid
In DepthDetails US Patent
LigandPNGBDBM377083(US10259818, Example 65 | US9944646, Example 66)
Affinity DataIC50: <100nM. Assay description: The kinase reaction was conducted in polystyrene 384-well matrix white plate from Thermo Fisher Scientific in a final volume of 25 μL. Inhibitor...
Ligand InfoPC cidPC sid
In DepthDetails US Patent