BDBM37714 4-[(1-ethyl-2-keto-benzo[cd]indol-6-yl)carbamoylamino]benzoic acid ethyl ester::4-[[[(1-ethyl-2-oxo-6-benzo[cd]indolyl)amino]-oxomethyl]amino]benzoic acid ethyl ester::MLS000087771::SMR000023991::cid_3239620::ethyl 4-({[(1-ethyl-2-oxo-1,2-dihydrobenzo[cd]indol-6-yl)amino]carbonyl}amino)benzoate::ethyl 4-[(1-ethyl-2-oxidanylidene-benzo[cd]indol-6-yl)carbamoylamino]benzoate::ethyl 4-[(1-ethyl-2-oxobenzo[cd]indol-6-yl)carbamoylamino]benzoate
SMILES CCOC(=O)c1ccc(NC(=O)Nc2ccc3N(CC)C(=O)c4cccc2c34)cc1
InChI Key InChIKey=XMJIRJQSDSUUTG-UHFFFAOYSA-N
Data  2 KI  2 IC50
  Tab Delimited (TSV)   2D SDfile   Computed 3D by Vconf -m prep SDfile
Find this compound or compounds like it in BindingDB:
Activity Spreadsheet -- Enzyme Inhibition Constant Data from BindingDB
Found 4 hits for monomerid = 37714
TargetN-formyl peptide receptor 2(Homo sapiens (Human))
Nmmlsc
Curated by PubChem BioAssay
LigandPNGBDBM37714(4-[(1-ethyl-2-keto-benzo[cd]indol-6-yl)carbamoylam...)
Affinity DataKi: >4.03E+4nM. Assay description: University of New Mexico Assay Overview Assay Support: NIH 1R03MH076381-01 Assay for Formylpeptide Receptor Family Ligands PI: Bruce S. Edwards, Ph....
In DepthDetails PCBioAssay
TargetfMet-Leu-Phe receptor(Homo sapiens (Human))
Nmmlsc
Curated by PubChem BioAssay
LigandPNGBDBM37714(4-[(1-ethyl-2-keto-benzo[cd]indol-6-yl)carbamoylam...)
Affinity DataKi: >4.37E+4nM. Assay description: University of New Mexico Assay Overview: Assay Support: NIH 1R03MH076381-01 Assay for Formylpeptide Receptor Family Ligands PI: Bruce S. Edwards, Ph...
In DepthDetails PCBioAssay
TargetN-formyl peptide receptor 2(Homo sapiens (Human))
Nmmlsc
Curated by PubChem BioAssay
LigandPNGBDBM37714(4-[(1-ethyl-2-keto-benzo[cd]indol-6-yl)carbamoylam...)
Affinity DataIC50: >6.67E+4nM. Assay description: University of New Mexico Assay Overview Assay Support: NIH 1R03MH076381-01 Assay for Formylpeptide Receptor Family Ligands PI: Bruce S. Edwards, Ph....
In DepthDetails PCBioAssay
TargetfMet-Leu-Phe receptor(Homo sapiens (Human))
Nmmlsc
Curated by PubChem BioAssay
LigandPNGBDBM37714(4-[(1-ethyl-2-keto-benzo[cd]indol-6-yl)carbamoylam...)
Affinity DataIC50: >6.67E+4nM. Assay description: University of New Mexico Assay Overview: Assay Support: NIH 1R03MH076381-01 Assay for Formylpeptide Receptor Family Ligands PI: Bruce S. Edwards, Ph...
In DepthDetails PCBioAssay