BDBM377327 US10265310, Example 84::trans-ent2-1-(4-chlorophenyl)-3-(1-(cyclopropanecarbonyl)-4-phenylpiperidin-3-yl)urea
SMILES Clc1ccc(NC(=O)N[C@@H]2CN(CC[C@H]2c2ccccc2)C(=O)C2CC2)cc1
InChI Key InChIKey=HFNWRTQMLLWXBK-VQTJNVASSA-N
Data  2 EC50
  Tab Delimited (TSV)   2D SDfile   Computed 3D by Vconf -m prep SDfile
Find this compound or compounds like it in BindingDB:
Activity Spreadsheet -- Enzyme Inhibition Constant Data from BindingDB
Found 2 hits for monomerid = 377327
TargetfMet-Leu-Phe receptor(Homo sapiens (Human))
GrÜNenthal
US Patent
LigandPNGBDBM377327(US10265310, Example 84 | trans-ent2-1-(4-chlorophe...)
Affinity DataEC50:  500nM. Assay description: Cryo-vial containing 6×106 cells (hFPR1-Gα15-CHO or hFPR2-Aq-CHO) was thawed in a 37° C. water bath. Cells were suspended in 10 ml of respective...
Ligand InfoPC cidPC sid
In DepthDetails US Patent
TargetN-formyl peptide receptor 2(Homo sapiens (Human))
GrÜNenthal
US Patent
LigandPNGBDBM377327(US10265310, Example 84 | trans-ent2-1-(4-chlorophe...)
Affinity DataEC50:  500nM. Assay description: Cryo-vial containing 6×106 cells (hFPR1-Gα15-CHO or hFPR2-Aq-CHO) was thawed in a 37° C. water bath. Cells were suspended in 10 ml of respective...
Ligand InfoPC cidPC sid
In DepthDetails US Patent