BDBM377413 US10266491, Example 95::US10676434, Example 95::US11053197, Example 95
SMILES NC(=O)c1cc(F)c(-c2ccc3CCN(C(=O)C=C)c3c2)c2c3ccccc3[nH]c12
InChI Key InChIKey=RCBLDZISIVWFRD-UHFFFAOYSA-N
Data  3 IC50
  Tab Delimited (TSV)   2D SDfile   Computed 3D by Vconf -m prep SDfile
Find this compound or compounds like it in BindingDB:
Activity Spreadsheet -- Enzyme Inhibition Constant Data from BindingDB
Found 3 hits for monomerid = 377413
TargetTyrosine-protein kinase BTK(Homo sapiens (Human))
Bristol-Myers Squibb
US Patent
LigandPNGBDBM377413(US10266491, Example 95 | US10676434, Example 95 | ...)
Affinity DataIC50:  0.0490nM. Assay description: To V-bottom 384-well plates were added test compounds, human recombinant Btk (1 nM, Invitrogen Corporation), fluoresceinated peptide (1.5 μM), A...
Ligand InfoPC cidPC sid
In DepthDetails US Patent
TargetTyrosine-protein kinase BTK(Homo sapiens (Human))
Bristol-Myers Squibb
US Patent
LigandPNGBDBM377413(US10266491, Example 95 | US10676434, Example 95 | ...)
Affinity DataIC50:  0.0490nM. Assay description: To V-bottom 384-well plates were added test compounds, human recombinant Btk (1 nM, Invitrogen Corporation), fluoresceinated peptide (1.5 ATP (20 and...
Ligand InfoPC cidPC sid
In DepthDetails US Patent
TargetTyrosine-protein kinase BTK(Homo sapiens (Human))
Bristol-Myers Squibb
US Patent
LigandPNGBDBM377413(US10266491, Example 95 | US10676434, Example 95 | ...)
Affinity DataIC50:  0.0490nM. Assay description: To V-bottom 384-well plates were added test compounds, human recombinant Btk (1 nM, Invitrogen Corporation), fluoresceinated peptide (1.5 μM), A...
Ligand InfoPC cidPC sid
In DepthDetails US Patent