BDBM377590 US10266493, Example 2JJJ::US10919858, Example 2JJJ
SMILES CC(C)(Sc1ccncc1-c1ccc(cc1F)C(N)=O)C(O)=O
InChI Key InChIKey=UETISENUIIDNRY-UHFFFAOYSA-N
Data  2 EC50
  Tab Delimited (TSV)   2D SDfile   Computed 3D by Vconf -m prep SDfile
Find this compound or compounds like it in BindingDB:
Activity Spreadsheet -- Enzyme Inhibition Constant Data from BindingDB
Found 2 hits for monomerid = 377590
TargetSolute carrier family 22 member 12(Homo sapiens (Human))
Ardea Biosciences
US Patent
LigandPNGBDBM377590(US10266493, Example 2JJJ | US10919858, Example 2JJ...)
Affinity DataEC50:  275nM. Assay description: HEK293 human embryonic kidney cells (ATCC #CRL-1573) were propagated in EMEM tissue culture medium as described by ATCC in an atmosphere of 5% C02 an...
Ligand InfoPC cidPC sid
In DepthDetails US Patent
TargetSolute carrier family 22 member 12(Homo sapiens (Human))
Ardea Biosciences
US Patent
LigandPNGBDBM377590(US10266493, Example 2JJJ | US10919858, Example 2JJ...)
Affinity DataEC50:  275nM. Assay description: HEK293 human embryonic kidney cells (ATCC# CRL-1573) were propagated in EMEM tissue culture medium as described by ATCC in an atmosphere of 5% CO2 an...
Ligand InfoPC cidPC sid
In DepthDetails US Patent