BDBM377610 3-({[3-methoxy-4-(1H-1,2,3,4-::US10266495, Compound I-22
SMILES COc1cc(NCc2cc3ccc(C)cc3[nH]c2=O)ccc1-n1cnnn1
InChI Key InChIKey=BPKREDZWJFPBSA-UHFFFAOYSA-N
Data  3 IC50
  Tab Delimited (TSV)   2D SDfile   Computed 3D by Vconf -m prep SDfile
Find this compound or compounds like it in BindingDB:
Activity Spreadsheet -- Enzyme Inhibition Constant Data from BindingDB
Found 3 hits for monomerid = 377610
TargetIsocitrate dehydrogenase [NADP] cytoplasmic [R132H](Homo sapiens (Human))
Sunshine Lake Pharma
US Patent
LigandPNGBDBM377610(3-({[3-methoxy-4-(1H-1,2,3,4- | US10266495, Compou...)
Affinity DataIC50:  550nM. Assay description: Assays were performed in a 384-well black plate. An aliquot of 250 nL of compound was incubated with 10 μL of 30 nM IDH1-R132H or 10 nM IDH1-R13...
Ligand InfoPC cidPC sid
In DepthDetails US Patent
TargetIsocitrate dehydrogenase [NADP] cytoplasmic(Homo sapiens (Human))
Forma Therapeutics
Curated by ChEMBL
LigandPNGBDBM377610(3-({[3-methoxy-4-(1H-1,2,3,4- | US10266495, Compou...)
Affinity DataIC50:  303nM. Assay description: Inhibition of human Myc-DDK-tagged IDH1 R132H mutant assessed as reduction in NADPH consumption pre-incubated for 15 mins followed by alpha-ketogluta...
Ligand InfoPC cidPC sid
In DepthDetails ArticlePubMed
TargetIsocitrate dehydrogenase [NADP] cytoplasmic [R132C](Homo sapiens (Human))
Sunshine Lake Pharma
US Patent
LigandPNGBDBM377610(3-({[3-methoxy-4-(1H-1,2,3,4- | US10266495, Compou...)
Affinity DataIC50: >1.00E+3nM. Assay description: Assays were performed in a 384-well black plate. An aliquot of 250 nL of compound was incubated with 10 μL of 30 nM IDH1-R132H or 10 nM IDH1-R13...
Ligand InfoPC cidPC sid
In DepthDetails US Patent