BDBM377691 US10266496, Example 3
SMILES OC(=O)c1ccc(cc1O)-c1cc(cc2OCOc12)C#N
InChI Key InChIKey=NAHVUCMYPWXJMC-UHFFFAOYSA-N
Data  2 IC50
  Tab Delimited (TSV)   2D SDfile   Computed 3D by Vconf -m prep SDfile
Find this compound or compounds like it in BindingDB:
Activity Spreadsheet -- Enzyme Inhibition Constant Data from BindingDB
Found 2 hits for monomerid = 377691
TargetSolute carrier family 22 member 12(Homo sapiens (Human))
Sunshine Lake Pharma
US Patent
LigandPNGBDBM377691(US10266496, Example 3)
Affinity DataIC50:  804nM. Assay description: a. Construction of a Cell Line Stably Expressing hURAT1hURAT1 plasmid was transfected into HEK293T cell, and a cell line stably expressing hURAT1 was...
Ligand InfoPC cidPC sid
In DepthDetails US Patent
TargetXanthine dehydrogenase/oxidase(Homo sapiens (Human))
Sunshine Lake Pharma
US Patent
LigandPNGBDBM377691(US10266496, Example 3)
Affinity DataIC50:  101nM. Assay description: The compound was diluted 2.5 fold with a buffer of 50 mM KH2PO4 to give a series of concentrations from 2000 nM to 0.524 nM. Then the diluted solutio...
Ligand InfoPC cidPC sid
In DepthDetails US Patent