BDBM378455 N-((2S,4S)-1-((4-(2-aminopropan-2-yl)phenyl)sulfonyl)-2-methylpiperidin-4-yl)-6-chloro-2-oxoindoline-5-carboxamide::US10266526, Compound 588
SMILES C[C@H]1C[C@H](CCN1S(=O)(=O)c1ccc(cc1)C(C)(C)N)NC(=O)c1cc2CC(=O)Nc2cc1Cl
InChI Key InChIKey=COTXWRYPVVLKQK-YOEHRIQHSA-N
Data  1 IC50
  Tab Delimited (TSV)   2D SDfile   Computed 3D by Vconf -m prep SDfile
Find this compound or compounds like it in BindingDB:
Activity Spreadsheet -- Enzyme Inhibition Constant Data from BindingDB
Found 1 hit for monomerid = 378455
TargetHistone-lysine N-methyltransferase SMYD3(Homo sapiens (Human))
Epizyme
US Patent
LigandPNGBDBM378455(N-((2S,4S)-1-((4-(2-aminopropan-2-yl)phenyl)sulfon...)
Affinity DataIC50:  1.98nM. Assay description: The assays were all performed in a buffer consisting of 25 mM Tris-Cl pH 8.0, 1 mM TCEP, 0.005% BSG, and 0.005% Tween 20, prepared on the day of use....
Ligand InfoPC cidPC sid
In DepthDetails US Patent