BDBM378478 1-methyl-2-oxo-N-((1R,3r,5S)-8-((piperidin-4-ylmethyl)sulfonyl)-8-azabicyclo[3.2.1]octan-3-yl)indoline-5-carboxamide::US10266526, Compound 611
SMILES CN1C(=O)Cc2cc(ccc12)C(=O)N[C@@H]1C[C@@H]2CC[C@H](C1)N2S(=O)(=O)CC1CCNCC1
InChI Key InChIKey=BUKHCHZZWYLKLC-ACDBMABISA-N
Data  3 IC50
  Tab Delimited (TSV)   2D SDfile   Computed 3D by Vconf -m prep SDfile
Find this compound or compounds like it in BindingDB:
Activity Spreadsheet -- Enzyme Inhibition Constant Data from BindingDB
Found 3 hits for monomerid = 378478
TargetHistone-lysine N-methyltransferase SMYD3(Homo sapiens (Human))
Epizyme
US Patent
LigandPNGBDBM378478(1-methyl-2-oxo-N-((1R,3r,5S)-8-((piperidin-4-ylmet...)
Affinity DataIC50:  25.9nM. Assay description: The assays were all performed in a buffer consisting of 25 mM Tris-Cl pH 8.0, 1 mM TCEP, 0.005% BSG, and 0.005% Tween 20, prepared on the day of use....
Ligand InfoPC cidPC sid
In DepthDetails US Patent
TargetHistone-lysine N-methyltransferase SMYD3(Homo sapiens (Human))
Epizyme
US Patent
LigandPNGBDBM378478(1-methyl-2-oxo-N-((1R,3r,5S)-8-((piperidin-4-ylmet...)
Affinity DataIC50:  3.90E+3nM. Assay description: Inhibition of human SMYD3 expressed in HEK293T/17 cells using FLAG-tagged MEKK2 as substrate incubated for 30 mins in low air flow area followed by i...
Ligand InfoPC cidPC sid
In DepthDetails ArticlePubMed
TargetHistone-lysine N-methyltransferase SMYD3(Homo sapiens (Human))
Epizyme
US Patent
LigandPNGBDBM378478(1-methyl-2-oxo-N-((1R,3r,5S)-8-((piperidin-4-ylmet...)
Affinity DataIC50:  26nM. Assay description: Inhibition of full length N-terminal His-tagged SMYD3 (1 to 428 residues) (unknown origin) expressed in Escherichia coli using N-terminal GST-tagged ...
Ligand InfoPC cidPC sid
In DepthDetails ArticlePubMed