BDBM378783 N-(1-((1-benzyl-1H-pyrazol-4-yl)methyl)azetidin-3-yl)-4-cyclopropylpicolinamide::US10266526, Compound 966
SMILES O=C(NC1CN(Cc2cnn(Cc3ccccc3)c2)C1)c1cc(ccn1)C1CC1
InChI Key InChIKey=PMULBZYSTIEGHU-UHFFFAOYSA-N
Data  1 IC50
  Tab Delimited (TSV)   2D SDfile   Computed 3D by Vconf -m prep SDfile
Find this compound or compounds like it in BindingDB:
Activity Spreadsheet -- Enzyme Inhibition Constant Data from BindingDB
Found 1 hit for monomerid = 378783
TargetN-lysine methyltransferase SMYD2(Homo sapiens (Human))
Epizyme
US Patent
LigandPNGBDBM378783(N-(1-((1-benzyl-1H-pyrazol-4-yl)methyl)azetidin-3-...)
Affinity DataIC50:  13nM. Assay description: The assays were all performed in a buffer consisting of 20 mM Bicine (pH=7.6), 1 mM TCEP, 0.005% Bovine Skin Gelatin, and 0.002% Tween20, prepared on...
Ligand InfoPC cidPC sid
In DepthDetails US Patent