BDBM3788 1-Phenylbenzimidazole deriv. 5::1-benzoyl-1H-1,3-benzodiazole
SMILES O=C(c1ccccc1)n1cnc2ccccc12
InChI Key InChIKey=IYVBKVVOHXVKRD-UHFFFAOYSA-N
Data  2 IC50
  Tab Delimited (TSV)   2D SDfile   Computed 3D by Vconf -m prep SDfile
Find this compound or compounds like it in BindingDB:
Activity Spreadsheet -- Enzyme Inhibition Constant Data from BindingDB
Found 2 hits for monomerid = 3788
TargetFibroblast growth factor receptor 1(Homo sapiens (Human))
University Of Auckland
LigandPNGBDBM3788(1-Phenylbenzimidazole deriv. 5 | 1-benzoyl-1H-1,3-...)
Affinity DataIC50: >5.00E+4nMpH: 7.4 T: 2°C. Assay description: IC50 is the inhibitor concentration which inhibits 50% of kinase activity that catalyzes the transfer of the terminal phosphate from [gamma-32P] labe...
In DepthDetails ArticlePubMed
TargetPlatelet-derived growth factor receptor beta(Homo sapiens (Human))
University Of Auckland
LigandPNGBDBM3788(1-Phenylbenzimidazole deriv. 5 | 1-benzoyl-1H-1,3-...)
Affinity DataIC50: >5.00E+4nMpH: 7.4 T: 2°C. Assay description: IC50 is the inhibitor concentration which inhibits 50% of kinase activity that catalyzes the transfer of the terminal phosphate from [gamma-32P] labe...
In DepthDetails ArticlePubMed