BDBM378858 US10266535, Compound 30
SMILES CS(=O)(=O)N1CCC[C@H](C1)n1nc(-c2ccc(Oc3ccccc3)cc2)c2c(N)ncnc12
InChI Key InChIKey=ZSPZCUAATJGYMC-QGZVFWFLSA-N
Data  2 IC50
  Tab Delimited (TSV)   2D SDfile   Computed 3D by Vconf -m prep SDfile
Find this compound or compounds like it in BindingDB:
Activity Spreadsheet -- Enzyme Inhibition Constant Data from BindingDB
Found 2 hits for monomerid = 378858
TargetTyrosine-protein kinase BTK(Homo sapiens (Human))
Hefei Institutes Of Physical Science, Chinese Academy Of Sciences
US Patent
LigandPNGBDBM378858(US10266535, Compound 30)
Affinity DataIC50:  1.83E+3nM. Assay description: In the experiments of in vitro enzymatic activity, the IC50 values of Compound 33, Compound 30, Compound 14, Compound 20, Compound 22, Compound 23, C...
Ligand InfoPC cidPC sid
In DepthDetails US Patent
TargetReceptor-type tyrosine-protein kinase FLT3(Homo sapiens (Human))
Hefei Institutes Of Physical Science, Chinese Academy Of Sciences
US Patent
LigandPNGBDBM378858(US10266535, Compound 30)
Affinity DataIC50:  122nM. Assay description: In the experiments of in vitro enzymatic activity, the IC50 values of Compound 33, Compound 30, Compound 14, Compound 20, Compound 22, Compound 23, C...
Ligand InfoPC cidPC sid
In DepthDetails US Patent