BDBM378910 US10266537, Compound 30
SMILES CC(C)Nc1ncnc(N)c1C(=N)C#Cc1cc(NC(=O)Nc2cccc(c2)C(F)(F)F)ccc1C
InChI Key InChIKey=POAOUERUKIFCQC-UHFFFAOYSA-N
Data  1 IC50
  Tab Delimited (TSV)   2D SDfile   Computed 3D by Vconf -m prep SDfile
Find this compound or compounds like it in BindingDB:
Activity Spreadsheet -- Enzyme Inhibition Constant Data from BindingDB
Found 1 hit for monomerid = 378910
TargetProto-oncogene tyrosine-protein kinase Src [1-530](Homo sapiens (Human))
St. Chuan University
US Patent
LigandPNGBDBM378910(US10266537, Compound 30)
Affinity DataIC50:  20nM. Assay description: The aim of this experiment is to detect the inhibitory activity of the compounds of the present invention against in vitro protein kinases using isot...
Ligand InfoPC cidPC sid
In DepthDetails US Patent