BDBM378988 2-[1-(2,6- dichlorobenzyl)- 1H-indazol-3-yl]- 5-methoxy-N- (pyridin-4- yl)pyrimidin-4- amine::US10266548, Example 15-4::US10266548, Example 2-9-1
SMILES COc1cnc(nc1Nc1ccncc1)-c1nn(Cc2c(Cl)cccc2Cl)c2ccccc12
InChI Key InChIKey=WKVJEUQFHJPHMA-UHFFFAOYSA-N
Data  2 IC50
  Tab Delimited (TSV)   2D SDfile   Computed 3D by Vconf -m prep SDfile
Find this compound or compounds like it in BindingDB:
Activity Spreadsheet -- Enzyme Inhibition Constant Data from BindingDB
Found 2 hits for monomerid = 378988
TargetMitotic checkpoint serine/threonine-protein kinase BUB1(Homo sapiens (Human))
Bayer Intellectual Property
US Patent
LigandPNGBDBM378988(2-[1-(2,6- dichlorobenzyl)- 1H-indazol-3-yl]- 5-me...)
Affinity DataIC50:  7.30nM. Assay description: Bub1-inhibitory activities of compounds described in the present invention were quantified using a time-resolved fluorescence energy transfer (TR-FRE...
Ligand InfoPC cidPC sid
In DepthDetails US Patent
TargetMitotic checkpoint serine/threonine-protein kinase BUB1(Homo sapiens (Human))
Bayer Intellectual Property
US Patent
LigandPNGBDBM378988(2-[1-(2,6- dichlorobenzyl)- 1H-indazol-3-yl]- 5-me...)
Affinity DataIC50:  6.70nM. Assay description: Bub1-inhibitory activities of compounds described in the present invention were quantified using a time-resolved fluorescence energy transfer (TR-FRE...
Ligand InfoPC cidPC sid
In DepthDetails US Patent